{"text_format":"1","workbook":"xlsx","n_sheets":6,"sheets":["Anleitung","Eingabe","Daten","Übersicht","Rangliste","Skalenwerte"],"not_rendered":{"charts":1,"images":1,"macros":1,"external_links":0,"defined_names":5,"comments":1,"pivot_tables":0},"unopened":[],"bounds":{"document_bytes":16777216,"sheet_cells":100000,"rows_first":2000,"rows_last":500,"rows_between":2000,"halvings":0,"cell_chars":16384,"cell_head_chars":4096},"cells_cut":0,"cells_raw":0,"read":"whole","date_system":"1900"}

{"sheet":"Anleitung","index":0,"n_rows":33,"n_cols":9,"rows_kept":33,"cut":false,"hidden":false,"merged":[[10,1,10,13],[8,1,8,13],[0,0,2,11],[4,1,4,13],[32,12,32,13],[25,1,25,13],[30,1,30,13],[6,1,6,13],[12,1,12,13],[14,1,14,13],[15,3,15,13],[21,1,21,2],[22,1,22,2],[23,1,23,2],[21,3,21,13],[29,1,29,13],[22,3,22,13],[27,1,27,13],[7,1,7,13],[23,3,23,13]]}
["Anleitung Auswertung LEMOVIS-T (Mannschaftssportarten)"]
[]
[]
[1,"Einleitung"]
[null,"Um das Problem der sozialen Erwünschtheit bei der Selbsteinschätzung von Leistungsmotivation mittels Fragebogen zu entschärfen, wird empfohlen, das von TrainerInnen beobachtete Verhalten (z. B. im Training, im Wettkampf, nach Niederlagen etc.) als Indikator für Leistungsmotivation heranzuziehen. LEMOVIS-T erlaubt die Erfassung des leistungsmotivierten Verhaltens von NachwuchsathletInnen in Mannschaftssportarten aus der Sicht der Trainerin oder des Trainers. "]
[2,"Durchführung "]
[null,"Das Fremdbeurteilungsverfahren sollte im besten Fall von zwei TrainerInnen (z. B. Haupt- und AssistenztrainerIn) unabhängig voneinander, d. h. in zwei separaten Excel-Dateien ausgefüllt werden. Die Beurteilungen können im Tabellenblatt Eingabe dieser Datei direkt eingegeben und dann via Button Beurteilungen speichern & neue Eingabe direkt in das Tabellenblatt Daten übertragen werden. Dafür müssen alle farbig hinterlegten Felder ausgefüllt werden."]
[null,"Beurteilungsverfahren beeinflussen Selektionsentscheide und beeinflussen daher sowohl die sportliche wie auch persönliche Zukunft jeder einzelnen Athletin und jedes einzelnen Athleten. TrainerInnen sollten daher äusserst sorgfältig vorgehen."]
[null,"Link zum Testmanual \"LEMOVIS-T\""]
[3,"Datenübersicht"]
[null,"Im Tabellenblatt Daten finden sich in den Spalten G bis R die Beurteilungen von TrainerIn 1 . Falls - wie empfohlen - noch eine zweite Trainerin/ein zweiter Trainer denselben Athleten/dieselbe Athletin beurteilt, müssten diese Werte aus der Excel-Datei von TrainerIn 2 in die Spalten U bis AF eingetragen/kopiert werden."]
[4,"Ausgabe Resultate"]
[null,"Nachdem die Daten vollständig eingegeben worden sind, sind die Ergebnisse in Form von Skalenwerten in den Spalten AG bis AJ des Tabellenblattes Daten ersichtlich. Diese werden auch ausgegeben, wenn nur eine Trainerin/ein Trainer eine Beurteilung vorgenommen hat. "]
[5,"Interpretation der Resultate"]
[null,"Für eine individuelle Auswertung einer Athletin/eines Athleten kann im Tabellenblatt Übersicht im Feld C5  die persönliche Identifikationsnummer des Athleten bzw. der Athletin eingegeben, für den/die die Resultate angezeigt werden sollen. "]
[null,"Skalenwerte: ",null,"Die Skalenwerte sind jene Werte, welche die AthletInnen in der entsprechenden Skala erreicht haben. Hohe Werte sprechen dabei für eine hohe Ausprägung im entsprechenden Merkmals, tiefe Werte für eine tiefe Ausprägung. Es können dabei je nach Skala unterschiedliche Werte erreicht werden: "]
[null,null,null,"Eigeninitiative (EI)",null,"0-4"]
[null,null,null,"Erfolgsorientierung (EO)",null,"0-4"]
[null,null,null,"Leistungsbereitschaft (LB)",null,"0-4"]
[null,null,null,"Gesamtskalenwert (GS)",null,"0-12"]
[6,"Beschreibung der Skalen"]
[null,"Eigen-\ninitiative (EI)",null,"AthletInnen mit hoher Eigeninitiative zeigen ein hohes Engagement im Training. Sie möchten aus eigenem Antrieb heraus mehr trainieren, um ihre Ziele zu erreichen. Deshalb kommen sie häufig früher ins Training, bleiben länger oder möchten, dass der Trainer zusätzliche Trainings plant. Diese Skala weist meistens die geringste Zustimmungshäufigkeit aller drei Skalen von LEMOVIS-T auf."]
[null,"Erfolgs-\norientierung (EO)",null,"Athleten mit einer hohen Ausprägung in Erfolgsorientierung lieben Wettkämpfe und setzten sich zum Ziel, diese zu gewinnen. Gelingt ihnen dies nicht, sind sie unzufrieden. "]
[null,"Leistungs-\nbereitschaft (LB)",null,"Athleten mit einer hohen Ausprägung in der Leistungsbereitsschaft sind für anstehende Leistung bereit und möchten diese auch erbringen. Sie orientieren sich an stärkeren AthletInnen und trainieren manchmal bis zur Erschöpfung. In diese Skala weisen die meisten AthletInnen die höchsten Werte auf."]
[7,"Speichern als PDF"]
[null,"Um die Resultateübersicht zu speichern, wird via Button PDF erstellen ein PDF erstellt und an demselben Ort abgespeichert, an dem die Excel-Datei selbst abgespeichert ist. Dateiname: VornameDatum.pdf (z. B. Joel20180920.pdf)"]
[8,"Ranglisten erstellen und analysieren"]
[null,"Um die eingegebenen Daten gruppenweise zu analysieren, im Tabellenblatt Rangliste den Button Daten in Rangliste übertragen (dauert einige Sekunden!) und dann nach Belieben sortieren. Es können nur alle Datensätze gemeinsam übertragen werden. Sollten spezifischere Analysen durchgeführt werden, müssen die ausgewählten Datensätze manuell kopiert werden. "]
[9,"Weiterführende Informationen"]
[null,"Zuber, C. & Conzelmann, A. (2018). Leistungsmotiviertes Verhalten in Mannschaftssportarten – LEMOVIS-T. Testmanual. Bern: Universität Bern, Bern Open Publishing."]
[null,"Zuber, C. & Conzelmann, A. (2017). Leistungsmotiviertes Verhalten im Sport: Konstruktion und Validierung eines Beobachtungsrasters - LEMOVIS-T. Kurzbericht. Bern: Universität, Institut für Sportwissenschaft."]
[10,"Kontakt"]
[null,"Dr. Claudia Zuber, Institut für Sportwissenschaft, Universität Bern",null,null,null,null,null,null,"claudia.zuber@ispw.unibe.ch "]

{"sheet":"Eingabe","index":1,"n_rows":28,"n_cols":14,"rows_kept":28,"cut":false,"hidden":false,"merged":[[23,9,23,13],[0,0,1,10],[6,2,6,3],[6,6,6,7],[2,0,2,13],[8,0,8,13],[4,0,4,1],[23,1,23,8],[21,9,21,13],[22,9,22,13],[16,1,16,8],[17,1,17,8],[18,1,18,8],[19,1,19,8],[20,1,20,8],[21,1,21,8],[22,1,22,8],[19,9,19,13],[20,9,20,13],[9,0,12,13],[6,4,6,5],[16,9,16,13],[17,9,17,13],[18,9,18,13],[14,9,14,13],[24,1,24,8],[25,1,25,8],[26,1,26,8],[27,1,27,8],[24,9,24,13],[27,9,27,13],[26,9,26,13],[25,9,25,13]]}
["Durchführung LEMOVIS-T \n(Mannschaftssportarten)"]
[]
[" Angaben beurteilte/r AthletIn"]
[]
["Athleten-Nr. ",null,null,"Vorname",null,"Nachname",null,"Geb. Datum"]
[]
[null,null,"Name TrainerIn",null,null,null,"Datum Beurteilung",null,{"$f":"TODAY()","v":"2019-02-13"}]
[]
["Instruktionen"]
["Unten finden Sie eine Liste mit unterschiedlichen Verhaltensweisen. Bitte schätzen Sie jeweils für die Athletin/den Athleten, die/den sie beurteilen möchten, ein, wie oft sie oder er diese Verhaltensweisen in den letzten 12 Monaten oder seit sie mit der Athletin/dem Athleten zusammenarbeiten, gezeigt hat. Dabei ist es wichtig, dass Sie jeweils die Antwort auswählen, die spontan am besten zum entsprechenden Athleten/zur entsprechenden Athletin passt."]
[]
[]
[]
[]
["Wie oft hat ",null,{"$f":"E5","v":0},"die untenstehenden Verhaltensweisen in den letzten 12 Monaten gezeigt?",null,null,null,null,null,"Rating"]
[null,null,null,null,null,null,null,null,null,"0 =\nnoch nie","1 = selten","2 = manchmal","3 =\noft","4 =\nimmer"]
[1,"hat beim Trainer/bei der Trainerin nach weiteren Trainingsmöglichkeiten gefragt, um sich noch weiter zu verbessern"]
[2,"hat genervt reagiert, als das Team ein Spiel verloren hat"]
[3,"hat auch eine einfache Übung konzentriert durchgeführt und wenige Fehler gemacht"]
[4,"ist vor Beginn des Trainings als eine/r der Ersten auf dem Trainingsgelände gewesen und hat selbstständig technische Abläufe geübt"]
[5,"hat vor dem Spiel klar und deutlich kommuniziert, dass er/sie an diesem Tag gewinnen will"]
[6,"hat sich bei hoch beanspruchenden Übungen bis zur Erschöpfung verausgabt"]
[7,"ist nach dem Training noch länger geblieben, um weiterzutrainieren"]
[8,"hat gezeigt, dass er/sie mit einer Niederlage oder einem Unentschieden nicht zufrieden ist"]
[9,"hat im Training eine \"aktive\" Körperhaltung gezeigt"]
[10,"hat sich selbstständig nach den Inhalten verpasster Trainings erkundigt"]
[11,"hat emotional reagiert, als er/sie seine/ihre selbstgesetzten Ziele erreicht hat"]
[12,"hat eine Aufgabe immer wieder zu lösen versucht, auch wenn er/sie bis anhin nicht erfolgreich war"]

{"sheet":"Daten","index":2,"n_rows":200,"n_cols":36,"rows_kept":200,"cut":false,"hidden":false,"merged":[[0,0,0,3],[0,32,0,35],[1,4,1,5],[1,18,1,19],[0,6,0,17],[0,4,0,5],[0,18,0,19]]}
["Angaben AthletIn",null,null,null,"Angaben TrainerIn 1",null,"Beurteilung TrainerIn 1",null,null,null,null,null,null,null,null,null,null,null,"Angaben TrainerIn 2",null,"Beurteilung TrainerIn 2",null,null,null,null,null,null,null,null,null,null,null,"Skalenwerte"]
[null,null,null,null,null,null,"0 =","noch nie","1=","selten","2=","manchmal","3=","oft","4=","immer",null,null,null,null,"0 =","noch nie","1=","selten","2=","manchmal","3=","oft","4=","immer"]
["Athleten-Nr.","Vorname","Nachname","Geburts-\ndatum","Name\nTrainerIn 1","Datum\nBeurteilung 1",1,2,3,4,5,6,7,8,9,10,11,12,"Name\nTrainerIn 2","Datum\nBeurteilung 2",1,2,3,4,5,6,7,8,9,10,11,12,"Gesamt-\nskalenwert (GS)","Eigen-initiative (EI)","Erfolgs-\norientierung (EO)","Leistungs-\nbereitschaft (LB)"]
[null,null,null,null,null,null,null,null,null,null,null,null,null,null,null,null,null,null,null,null,null,null,null,null,null,null,null,null,null,null,null,null,{"$f":"SUM(AH4:AJ4)","v":{"$error":"#DIV/0!"}},{"$f":"AVERAGE(G4,J4,M4,P4,U4,X4,AA4,AD4)","v":{"$error":"#DIV/0!"}},{"$f":"AVERAGE(H4,K4,N4, Q4,V4,Y4,AB4,AE4)","v":{"$error":"#DIV/0!"}},{"$f":"AVERAGE(I4,L4,O4,R4,W4,Z4,AC4,AF4)","v":{"$error":"#DIV/0!"}}]
[null,null,null,null,null,null,null,null,null,null,null,null,null,null,null,null,null,null,null,null,null,null,null,null,null,null,null,null,null,null,null,null,{"$f":"SUM(AH5:AJ5)","v":{"$error":"#DIV/0!"}},{"$f":"AVERAGE(G5,J5,M5,P5,U5,X5,AA5,AD5)","v":{"$error":"#DIV/0!"}},{"$f":"AVERAGE(H5,K5,N5, Q5,V5,Y5,AB5,AE5)","v":{"$error":"#DIV/0!"}},{"$f":"AVERAGE(I5,L5,O5,R5,W5,Z5,AC5,AF5)","v":{"$error":"#DIV/0!"}}]
[null,null,null,null,null,null,null,null,null,null,null,null,null,null,null,null,null,null,null,null,null,null,null,null,null,null,null,null,null,null,null,null,{"$error":"#DIV/0!"},{"$error":"#DIV/0!"},{"$error":"#DIV/0!"},{"$error":"#DIV/0!"}]
[null,null,null,null,null,null,null,null,null,null,null,null,null,null,null,null,null,null,null,null,null,null,null,null,null,null,null,null,null,null,null,null,{"$error":"#DIV/0!"},{"$error":"#DIV/0!"},{"$error":"#DIV/0!"},{"$error":"#DIV/0!"}]
[null,null,null,null,null,null,null,null,null,null,null,null,null,null,null,null,null,null,null,null,null,null,null,null,null,null,null,null,null,null,null,null,{"$error":"#DIV/0!"},{"$error":"#DIV/0!"},{"$error":"#DIV/0!"},{"$error":"#DIV/0!"}]
[null,null,null,null,null,null,null,null,null,null,null,null,null,null,null,null,null,null,null,null,null,null,null,null,null,null,null,null,null,null,null,null,{"$error":"#DIV/0!"},{"$error":"#DIV/0!"},{"$error":"#DIV/0!"},{"$error":"#DIV/0!"}]
[null,null,null,null,null,null,null,null,null,null,null,null,null,null,null,null,null,null,null,null,null,null,null,null,null,null,null,null,null,null,null,null,{"$f":"SUM(AH10:AJ10)","v":{"$error":"#DIV/0!"}},{"$error":"#DIV/0!"},{"$error":"#DIV/0!"},{"$error":"#DIV/0!"}]
[null,null,null,null,null,null,null,null,null,null,null,null,null,null,null,null,null,null,null,null,null,null,null,null,null,null,null,null,null,null,null,null,{"$f":"SUM(AH11:AJ11)","v":{"$error":"#DIV/0!"}},{"$error":"#DIV/0!"},{"$error":"#DIV/0!"},{"$error":"#DIV/0!"}]
[null,null,null,null,null,null,null,null,null,null,null,null,null,null,null,null,null,null,null,null,null,null,null,null,null,null,null,null,null,null,null,null,{"$error":"#DIV/0!"},{"$error":"#DIV/0!"},{"$error":"#DIV/0!"},{"$error":"#DIV/0!"}]
[null,null,null,null,null,null,null,null,null,null,null,null,null,null,null,null,null,null,null,null,null,null,null,null,null,null,null,null,null,null,null,null,{"$error":"#DIV/0!"},{"$error":"#DIV/0!"},{"$error":"#DIV/0!"},{"$error":"#DIV/0!"}]
[null,null,null,null,null,null,null,null,null,null,null,null,null,null,null,null,null,null,null,null,null,null,null,null,null,null,null,null,null,null,null,null,{"$error":"#DIV/0!"},{"$error":"#DIV/0!"},{"$error":"#DIV/0!"},{"$error":"#DIV/0!"}]
[null,null,null,null,null,null,null,null,null,null,null,null,null,null,null,null,null,null,null,null,null,null,null,null,null,null,null,null,null,null,null,null,{"$error":"#DIV/0!"},{"$error":"#DIV/0!"},{"$error":"#DIV/0!"},{"$error":"#DIV/0!"}]
[null,null,null,null,null,null,null,null,null,null,null,null,null,null,null,null,null,null,null,null,null,null,null,null,null,null,null,null,null,null,null,null,{"$error":"#DIV/0!"},{"$error":"#DIV/0!"},{"$error":"#DIV/0!"},{"$error":"#DIV/0!"}]
[null,null,null,null,null,null,null,null,null,null,null,null,null,null,null,null,null,null,null,null,null,null,null,null,null,null,null,null,null,null,null,null,{"$error":"#DIV/0!"},{"$error":"#DIV/0!"},{"$error":"#DIV/0!"},{"$error":"#DIV/0!"}]
[null,null,null,null,null,null,null,null,null,null,null,null,null,null,null,null,null,null,null,null,null,null,null,null,null,null,null,null,null,null,null,null,{"$error":"#DIV/0!"},{"$error":"#DIV/0!"},{"$error":"#DIV/0!"},{"$error":"#DIV/0!"}]
[null,null,null,null,null,null,null,null,null,null,null,null,null,null,null,null,null,null,null,null,null,null,null,null,null,null,null,null,null,null,null,null,{"$error":"#DIV/0!"},{"$error":"#DIV/0!"},{"$error":"#DIV/0!"},{"$error":"#DIV/0!"}]
[null,null,null,null,null,null,null,null,null,null,null,null,null,null,null,null,null,null,null,null,null,null,null,null,null,null,null,null,null,null,null,null,{"$error":"#DIV/0!"},{"$error":"#DIV/0!"},{"$error":"#DIV/0!"},{"$error":"#DIV/0!"}]
[null,null,null,null,null,null,null,null,null,null,null,null,null,null,null,null,null,null,null,null,null,null,null,null,null,null,null,null,null,null,null,null,{"$error":"#DIV/0!"},{"$error":"#DIV/0!"},{"$error":"#DIV/0!"},{"$error":"#DIV/0!"}]
[null,null,null,null,null,null,null,null,null,null,null,null,null,null,null,null,null,null,null,null,null,null,null,null,null,null,null,null,null,null,null,null,{"$error":"#DIV/0!"},{"$error":"#DIV/0!"},{"$error":"#DIV/0!"},{"$error":"#DIV/0!"}]
[null,null,null,null,null,null,null,null,null,null,null,null,null,null,null,null,null,null,null,null,null,null,null,null,null,null,null,null,null,null,null,null,{"$error":"#DIV/0!"},{"$error":"#DIV/0!"},{"$error":"#DIV/0!"},{"$error":"#DIV/0!"}]
[null,null,null,null,null,null,null,null,null,null,null,null,null,null,null,null,null,null,null,null,null,null,null,null,null,null,null,null,null,null,null,null,{"$error":"#DIV/0!"},{"$error":"#DIV/0!"},{"$error":"#DIV/0!"},{"$error":"#DIV/0!"}]
[null,null,null,null,null,null,null,null,null,null,null,null,null,null,null,null,null,null,null,null,null,null,null,null,null,null,null,null,null,null,null,null,{"$error":"#DIV/0!"},{"$error":"#DIV/0!"},{"$error":"#DIV/0!"},{"$error":"#DIV/0!"}]
[null,null,null,null,null,null,null,null,null,null,null,null,null,null,null,null,null,null,null,null,null,null,null,null,null,null,null,null,null,null,null,null,{"$error":"#DIV/0!"},{"$error":"#DIV/0!"},{"$error":"#DIV/0!"},{"$error":"#DIV/0!"}]
[null,null,null,null,null,null,null,null,null,null,null,null,null,null,null,null,null,null,null,null,null,null,null,null,null,null,null,null,null,null,null,null,{"$error":"#DIV/0!"},{"$error":"#DIV/0!"},{"$error":"#DIV/0!"},{"$error":"#DIV/0!"}]
[null,null,null,null,null,null,null,null,null,null,null,null,null,null,null,null,null,null,null,null,null,null,null,null,null,null,null,null,null,null,null,null,{"$error":"#DIV/0!"},{"$error":"#DIV/0!"},{"$error":"#DIV/0!"},{"$error":"#DIV/0!"}]
[null,null,null,null,null,null,null,null,null,null,null,null,null,null,null,null,null,null,null,null,null,null,null,null,null,null,null,null,null,null,null,null,{"$error":"#DIV/0!"},{"$error":"#DIV/0!"},{"$error":"#DIV/0!"},{"$error":"#DIV/0!"}]
[null,null,null,null,null,null,null,null,null,null,null,null,null,null,null,null,null,null,null,null,null,null,null,null,null,null,null,null,null,null,null,null,{"$error":"#DIV/0!"},{"$error":"#DIV/0!"},{"$error":"#DIV/0!"},{"$error":"#DIV/0!"}]
[null,null,null,null,null,null,null,null,null,null,null,null,null,null,null,null,null,null,null,null,null,null,null,null,null,null,null,null,null,null,null,null,{"$error":"#DIV/0!"},{"$error":"#DIV/0!"},{"$error":"#DIV/0!"},{"$error":"#DIV/0!"}]
[null,null,null,null,null,null,null,null,null,null,null,null,null,null,null,null,null,null,null,null,null,null,null,null,null,null,null,null,null,null,null,null,{"$error":"#DIV/0!"},{"$error":"#DIV/0!"},{"$error":"#DIV/0!"},{"$error":"#DIV/0!"}]
[null,null,null,null,null,null,null,null,null,null,null,null,null,null,null,null,null,null,null,null,null,null,null,null,null,null,null,null,null,null,null,null,{"$error":"#DIV/0!"},{"$error":"#DIV/0!"},{"$error":"#DIV/0!"},{"$error":"#DIV/0!"}]
[null,null,null,null,null,null,null,null,null,null,null,null,null,null,null,null,null,null,null,null,null,null,null,null,null,null,null,null,null,null,null,null,{"$error":"#DIV/0!"},{"$error":"#DIV/0!"},{"$error":"#DIV/0!"},{"$error":"#DIV/0!"}]
[null,null,null,null,null,null,null,null,null,null,null,null,null,null,null,null,null,null,null,null,null,null,null,null,null,null,null,null,null,null,null,null,{"$error":"#DIV/0!"},{"$error":"#DIV/0!"},{"$error":"#DIV/0!"},{"$error":"#DIV/0!"}]
[null,null,null,null,null,null,null,null,null,null,null,null,null,null,null,null,null,null,null,null,null,null,null,null,null,null,null,null,null,null,null,null,{"$error":"#DIV/0!"},{"$error":"#DIV/0!"},{"$error":"#DIV/0!"},{"$error":"#DIV/0!"}]
[null,null,null,null,null,null,null,null,null,null,null,null,null,null,null,null,null,null,null,null,null,null,null,null,null,null,null,null,null,null,null,null,{"$error":"#DIV/0!"},{"$error":"#DIV/0!"},{"$error":"#DIV/0!"},{"$error":"#DIV/0!"}]
[null,null,null,null,null,null,null,null,null,null,null,null,null,null,null,null,null,null,null,null,null,null,null,null,null,null,null,null,null,null,null,null,{"$error":"#DIV/0!"},{"$error":"#DIV/0!"},{"$error":"#DIV/0!"},{"$error":"#DIV/0!"}]
[null,null,null,null,null,null,null,null,null,null,null,null,null,null,null,null,null,null,null,null,null,null,null,null,null,null,null,null,null,null,null,null,{"$error":"#DIV/0!"},{"$error":"#DIV/0!"},{"$error":"#DIV/0!"},{"$error":"#DIV/0!"}]
[null,null,null,null,null,null,null,null,null,null,null,null,null,null,null,null,null,null,null,null,null,null,null,null,null,null,null,null,null,null,null,null,{"$error":"#DIV/0!"},{"$error":"#DIV/0!"},{"$error":"#DIV/0!"},{"$error":"#DIV/0!"}]
{"$rows_left_out":161}
{"sheet":"Übersicht","index":3,"n_rows":27,"n_cols":13,"rows_kept":27,"cut":false,"hidden":false,"merged":[[0,0,2,10],[26,3,26,4],[26,0,26,1],[3,0,3,12],[8,10,8,11],[9,10,9,11],[11,10,11,11],[10,10,10,11],[5,0,5,12],[6,7,6,8],[4,4,4,5]]}
["Übersicht Auswertung LEMOVIS-T (Mannschaftssportarten)"]
[]
[]
[" Angaben AthletIn"]
[null,"Nr:",1,"Name:",{"$f":"VLOOKUP(C5,Daten!A4:E200,2,)","v":{"$error":"#N/A"}},null,{"$f":"VLOOKUP(C5,Daten!A4:F200,3,)","v":{"$error":"#N/A"}},"Datum: ",{"$f":"VLOOKUP(C5,Daten!A4:F200,6,)","v":{"$error":"#N/A"}},"Geb. Datum: ",{"$f":"VLOOKUP(C5,Daten!A4:F200,4,)","v":{"$error":"#N/A"}},"Alter:",{"$f":"DATEDIF(K5,I5,\"y\")","v":{"$error":"#N/A"}}]
["Beurteilung AthletIn"]
[]
[null,null,null,null,null,null,null,null,null,null,"Skala",null,"Skalenwert"]
[null,"Leistungsmotiviertes Verhalten von ",null,null,null,{"$f":"E5","v":{"$error":"#N/A"}},{"$f":"G5","v":{"$error":"#N/A"}},"am ",{"$f":"I5","v":{"$error":"#N/A"}},null,"Eigeninitiative",null,{"$f":"VLOOKUP(C5,Daten!A4:AJ201,34,TRUE)","v":{"$error":"#N/A"}}]
[null,null,null,null,null,null,null,null,null,null,"Erfolgsorientierung ",null,{"$f":"VLOOKUP(C5,Daten!A4:AJ201,35,TRUE)","v":{"$error":"#N/A"}}]
[null,null,null,null,null,null,null,null,null,null,"Leistungsbereitschaft",null,{"$f":"VLOOKUP(C5,Daten!A4:AJ201,36,TRUE)","v":{"$error":"#N/A"}}]
[null,null,null,null,null,null,null,null,null,null,"Gesamtskalenwert",null,{"$f":"VLOOKUP(C5,Daten!A4:AJ201,33,TRUE)","v":{"$error":"#N/A"}}]
[]
[]
[]
[]
[]
[]
[]
[]
[]
[]
[]
[]
[]
[]
["Datum:",null,{"$f":"TODAY()","v":"2019-02-13"},"Beurteilung von:",null,null,{"$f":"VLOOKUP(C5,Daten!A4:F200,5,)","v":{"$error":"#N/A"}}]

{"sheet":"Rangliste","index":4,"n_rows":2,"n_cols":8,"rows_kept":2,"cut":false,"hidden":false,"merged":[[0,0,0,3],[0,4,0,7]]}
["Angaben AthletIn",null,null,null,"Skalenwerte"]
["Athleten-Nr.","Vorname","Nachname","Geburts-\ndatum","Gesamt-\nskalenwert (GS)","Eigeninitiative (EI)","Erfolgs-\norientierung (EO)","Leistungs-\nbereitschaft (LB)"]

{"sheet":"Skalenwerte","index":5,"n_rows":6,"n_cols":1,"rows_kept":6,"cut":false,"hidden":true,"merged":[]}
["Skalenwerte"]
[0]
[1]
[2]
[3]
[4]