{"text_format":"3","workbook":"xlsx","n_sheets":6,"sheets":["Anleitung","Instructions","Eingabeblatt","Table males","Table females","Dropdownliste"],"not_rendered":{"images":3,"defined_names":4},"read":"whole","date_system":"1900"}

{"sheet":"Anleitung","index":0,"n_rows":51,"n_cols":3,"rows_kept":51}
[]
[null,"Anleitung zur Bestimmung der geschätzten Erwachsenengrösse nach Khamis- Roche bei Mädchen und Knaben"]
[]
[null,"In einigen Sportarten ist die Erwachenengrösse ein leistungslimitierendes Kriterium. Die Khamis-Roche-Methode (1) ist eine praktikable Möglichkeit die geschätzte Erwachsenengrösse zu bestimmen."]
[null,"Die nachfolgende Anleitung soll sicherstellen, dass die Tests (gemäss Swiss Olympic Manual \"Talentidentifikation und -selektion\") möglichst standardisiert umgesetzt werden können."]
[]
[null,"             Die Tests beeinflussen Selektonsentscheide und beinflussen daher sowohl die sportliche wie auch auf die persönliche Zukunft jedes Athletn/-in."]
[null,"             Der Testleiter/die Testleiterin trägt daher eine grosse Verantwortung, genau und seriös zu testen!"]
[]
[]
[null,"Optimale Rahmenbedingungen:"]
[null,"-   Den Test vorher ankündigen (auf normale Nahrungsaufnahme hinweisen, am Testtag erfragen, ob aussergewöhnliche Gewichtsveränderung vorliegt; z.B. durch Erbrechen, falls ja, Test auf einen"]
[null,"    anderen Tag verschieben)"]
[null,"-   Test morgens und vor sportlicher Betätigung durchführen."]
[null,"-   Athlet/in trägt während des Tests nur Unterwäsche (keine Socken, keine Schuhe, keine langen Hosen,…). Die Athletinnen können einheitliche Shorts und Dresses tragen. Das Gewicht der Shorts und"]
{"$rows_left_out":37}
{"sheet":"Instructions","index":1,"n_rows":57,"n_cols":3,"rows_kept":57}
[]
[null,"Instructions pour définir la taille à l'âge adulte d'après Khamis-Roche pour les filles et les graçons"]
[]
[null,"Dans certaines disciplines sportives, la taille corporelle est un facteur limitant la performance. La méthode de Khamis-Roche (1) est une méthode practique pour estimer"]
[null,"la taille à l'âge adulte. Les instructions ci-dessous visent à assurer la réalisation la plus standardisée possible (conformément au manuel de Swiss Olympic"]
[null,"pour la détection et la sélection des talents)"]
[]
[null,null,"   Les tests influencent le processus de sélection ainsi que la décision de sélection et ont une influence sur l'avenir sportif et personnel de chaque athlète. "]
[null,null,"   Le responsable du test est en charge de tester de manière exacte et sérieuse. "]
[]
[]
[null,"Conditions à assurer"]
[null,"-         ","Annoncer le test à l’avance (préciser aux athlètes qu’ils peuvent s’alimenter normalement. Le jour du test, leur demander si leur poids risque de différer de leur"]
[null,null,"poids habituel, dans le cas où ils auraient vomi, p. ex.; si oui, reporter le test à un autre jour)."]
[null,"-","Réaliser le test avant l’activité physique – de préférence avant l’entraînement de l’après-midi ou du soir et, dans l’idéal, sans qu’un entraînement ait eu lieu le"]
{"$rows_left_out":43}
{"sheet":"Eingabeblatt","index":2,"n_rows":501,"n_cols":18,"rows_kept":501,"merged":[[1,5,1,12],[2,5,2,12]]}
[]
[{"$nulls":5},"Khamis-Roche bei Mädchen und Knaben - Einschätzung der biologischen Entwicklung in der Adoleszenz"]
[{"$nulls":5},"Khamis-Roche chez les filles et les garçons - Estimation de l'avancée du développement biologique lors de l'adolescence"]
[]
[null,"Geschlecht\nm = männlich      / f = weiblich\n\n\nSexe\nm = homme      / f = femme","Messdatum (tt.mm.jjjj)\n\n\n\nDate de la mesure (tt.mm.aaaa)","Name\n\n\n\n\nNom","Vorname\n\n\n\n\nPrénom","Geburtsdatum\n(tt.mm.jjjj)\n\n\n\nDate de naissance\n(jj.mm.aaaa)","Chronologisches Alter\n\n\n\n\nÂge chronologique","Körpergewicht (kg)\n\n\n\nPoids (kg)\n\n","Körpergrösse stehend (cm)\n\n\n\nTaille debout (cm)","Körpergrösse Vater (cm)\n\n\n\nTaille du papa (cm)","Körpergrösse Mutter (cm)\n\n\n\nTaille de la maman (cm)","Ergebnis geschätzte Erwachsenengrösse\n\nEstimation de la taille à l'âge adulte","Fehlerquote vom Ergebnis geschätzte Erwachsenen- grösse\n\nMarge d'erreur estimation de la taille à l'âge adulte","Prozent Erwachsenengrösse\n\n\nPourcentage de la taille adulte atteinte actuellement","Einschätzung biologische Entwicklung\n\n\n\n\nEstimation du dévelopment biologique"]
[{"$nulls":6},{"$f":"IF(AND(C6>0,F6>0),(C6-F6)/365.25,\"\")","v":""},{"$nulls":4},{"$f":"IF(OR(C6=\"\",G6=\"\",H6=\"\",I6=\"\",K6=\"\",B6=Dropdownliste!A$9,J6=\"\"),\"\",IF(B6=\"m\",(VLOOKUP(Eingabeblatt!$G6,'Table males'!$A$3:$E$138,2)+(VLOOKUP(Eingabeblatt!$G6,'Table males'!$A$3:$E$138,3)*Eingabeblatt!I6)+(VLOOKUP(Eingabeblatt!$G6,'Table males'!$A$3:$E$138,4)*Eingabeblatt!H6)+(VLOOKUP(Eingabeblatt!$G6,'Table males'!$A$3:$E$138,5)*(Eingabeblatt!J6+Eingabeblatt!K6)/2)),VLOOKUP(Eingabeblatt!$G6,'Table females'!$A$3:$E$138,2)+(VLOOKUP(Eingabeblatt!$G6,'Table females'!$A$3:$E$138,3)*Eingabeblatt!I6)+(VLOOKUP(Eingabeblatt!$G6,'Table females'!$A$3:$E$138,4)*Eingabeblatt!H6)+(VLOOKUP(Eingabeblatt!$G6,'Table females'!$A$3:$E$138,5)*(Eingabeblatt!J6+Eingabeblatt!K6)/2)))","v":""},{"$f":"CONCATENATE(\" \",IF(OR(J6=\"\",K6=\"\",L6=\"\"),\"\",IF(B6=\"m\",'Table males'!D$141,'Table females'!D$141)))","v":" "},{"$f":"IF(OR(J6=\"\",K6=\"\",I6=\"\",L6=\"\"),\"\",I6/L6)","v":""},{"$f":"IF(N6=\"\",\"\",IF(N6<0.8,\"vorpubertär / prépubère\",IF(N6<0.9,\"frühpubertär / début de la puberté\",IF(N6<0.95,\"pubertär / pubertaire\",\"spätpubertär / fin de la puberté\"))))","v":""},null,"*exakte Messung gemäss Anleitung befolgen / pour des mesures exactes suivre les instructions"]
[{"$nulls":6},"",{"$nulls":4},{"$f":"IF(OR(C7=\"\",G7=\"\",H7=\"\",I7=\"\",K7=\"\",B7=Dropdownliste!A$9,J7=\"\"),\"\",IF(B7=\"m\",(VLOOKUP(Eingabeblatt!$G7,'Table males'!$A$3:$E$138,2)+(VLOOKUP(Eingabeblatt!$G7,'Table males'!$A$3:$E$138,3)*Eingabeblatt!I7)+(VLOOKUP(Eingabeblatt!$G7,'Table males'!$A$3:$E$138,4)*Eingabeblatt!H7)+(VLOOKUP(Eingabeblatt!$G7,'Table males'!$A$3:$E$138,5)*(Eingabeblatt!J7+Eingabeblatt!K7)/2)),VLOOKUP(Eingabeblatt!$G7,'Table females'!$A$3:$E$138,2)+(VLOOKUP(Eingabeblatt!$G7,'Table females'!$A$3:$E$138,3)*Eingabeblatt!I7)+(VLOOKUP(Eingabeblatt!$G7,'Table females'!$A$3:$E$138,4)*Eingabeblatt!H7)+(VLOOKUP(Eingabeblatt!$G7,'Table females'!$A$3:$E$138,5)*(Eingabeblatt!J7+Eingabeblatt!K7)/2)))","v":""},{"$f":"CONCATENATE(\" \",IF(OR(J7=\"\",K7=\"\",L7=\"\"),\"\",IF(B7=\"m\",'Table males'!D$141,'Table females'!D$141)))","v":" "},{"$f":"IF(OR(J7=\"\",K7=\"\",I7=\"\",L7=\"\"),\"\",I7/L7)","v":""},{"$f":"IF(N7=\"\",\"\",IF(N7<0.8,\"vorpubertär / prépubère\",IF(N7<0.9,\"frühpubertär / début de la puberté\",IF(N7<0.95,\"pubertär / pubertaire\",\"spätpubertär / fin de la puberté\"))))","v":""},null,"† 90% der Kinder liegen in diesem Bereich / 90% des enfants se trouvent dans cette marge"]
[{"$nulls":6},"",{"$nulls":4},{"$f":"IF(OR(C8=\"\",G8=\"\",H8=\"\",I8=\"\",K8=\"\",B8=Dropdownliste!A$9,J8=\"\"),\"\",IF(B8=\"m\",(VLOOKUP(Eingabeblatt!$G8,'Table males'!$A$3:$E$138,2)+(VLOOKUP(Eingabeblatt!$G8,'Table males'!$A$3:$E$138,3)*Eingabeblatt!I8)+(VLOOKUP(Eingabeblatt!$G8,'Table males'!$A$3:$E$138,4)*Eingabeblatt!H8)+(VLOOKUP(Eingabeblatt!$G8,'Table males'!$A$3:$E$138,5)*(Eingabeblatt!J8+Eingabeblatt!K8)/2)),VLOOKUP(Eingabeblatt!$G8,'Table females'!$A$3:$E$138,2)+(VLOOKUP(Eingabeblatt!$G8,'Table females'!$A$3:$E$138,3)*Eingabeblatt!I8)+(VLOOKUP(Eingabeblatt!$G8,'Table females'!$A$3:$E$138,4)*Eingabeblatt!H8)+(VLOOKUP(Eingabeblatt!$G8,'Table females'!$A$3:$E$138,5)*(Eingabeblatt!J8+Eingabeblatt!K8)/2)))","v":""},{"$f":"CONCATENATE(\" \",IF(OR(J8=\"\",K8=\"\",L8=\"\"),\"\",IF(B8=\"m\",'Table males'!D$141,'Table females'!D$141)))","v":" "},"",""]
[{"$nulls":6},"",{"$nulls":4},{"$f":"IF(OR(C9=\"\",G9=\"\",H9=\"\",I9=\"\",K9=\"\",B9=Dropdownliste!A$9,J9=\"\"),\"\",IF(B9=\"m\",(VLOOKUP(Eingabeblatt!$G9,'Table males'!$A$3:$E$138,2)+(VLOOKUP(Eingabeblatt!$G9,'Table males'!$A$3:$E$138,3)*Eingabeblatt!I9)+(VLOOKUP(Eingabeblatt!$G9,'Table males'!$A$3:$E$138,4)*Eingabeblatt!H9)+(VLOOKUP(Eingabeblatt!$G9,'Table males'!$A$3:$E$138,5)*(Eingabeblatt!J9+Eingabeblatt!K9)/2)),VLOOKUP(Eingabeblatt!$G9,'Table females'!$A$3:$E$138,2)+(VLOOKUP(Eingabeblatt!$G9,'Table females'!$A$3:$E$138,3)*Eingabeblatt!I9)+(VLOOKUP(Eingabeblatt!$G9,'Table females'!$A$3:$E$138,4)*Eingabeblatt!H9)+(VLOOKUP(Eingabeblatt!$G9,'Table females'!$A$3:$E$138,5)*(Eingabeblatt!J9+Eingabeblatt!K9)/2)))","v":""},{"$f":"CONCATENATE(\" \",IF(OR(J9=\"\",K9=\"\",L9=\"\"),\"\",IF(B9=\"m\",'Table males'!D$141,'Table females'!D$141)))","v":" "},"",""]
[{"$nulls":6},"",{"$nulls":4},{"$f":"IF(OR(C10=\"\",G10=\"\",H10=\"\",I10=\"\",K10=\"\",B10=Dropdownliste!A$9,J10=\"\"),\"\",IF(B10=\"m\",(VLOOKUP(Eingabeblatt!$G10,'Table males'!$A$3:$E$138,2)+(VLOOKUP(Eingabeblatt!$G10,'Table males'!$A$3:$E$138,3)*Eingabeblatt!I10)+(VLOOKUP(Eingabeblatt!$G10,'Table males'!$A$3:$E$138,4)*Eingabeblatt!H10)+(VLOOKUP(Eingabeblatt!$G10,'Table males'!$A$3:$E$138,5)*(Eingabeblatt!J10+Eingabeblatt!K10)/2)),VLOOKUP(Eingabeblatt!$G10,'Table females'!$A$3:$E$138,2)+(VLOOKUP(Eingabeblatt!$G10,'Table females'!$A$3:$E$138,3)*Eingabeblatt!I10)+(VLOOKUP(Eingabeblatt!$G10,'Table females'!$A$3:$E$138,4)*Eingabeblatt!H10)+(VLOOKUP(Eingabeblatt!$G10,'Table females'!$A$3:$E$138,5)*(Eingabeblatt!J10+Eingabeblatt!K10)/2)))","v":""},{"$f":"CONCATENATE(\" \",IF(OR(J10=\"\",K10=\"\",L10=\"\"),\"\",IF(B10=\"m\",'Table males'!D$141,'Table females'!D$141)))","v":" "},{"$f":"IF(OR(J10=\"\",K10=\"\",I10=\"\",L10=\"\"),\"\",I10/L10)","v":""},{"$f":"IF(N10=\"\",\"\",IF(N10<0.8,\"vorpubertär / prépubère\",IF(N10<0.9,\"frühpubertär / début de la puberté\",IF(N10<0.95,\"pubertär / pubertaire\",\"spätpubertär / fin de la puberté\"))))","v":""},null,"Prozent Erwachsenengrösse","Einschätzung biologische Entwicklung"]
[{"$nulls":6},"",{"$nulls":4},{"$f":"IF(OR(C11=\"\",G11=\"\",H11=\"\",I11=\"\",K11=\"\",B11=Dropdownliste!A$9,J11=\"\"),\"\",IF(B11=\"m\",(VLOOKUP(Eingabeblatt!$G11,'Table males'!$A$3:$E$138,2)+(VLOOKUP(Eingabeblatt!$G11,'Table males'!$A$3:$E$138,3)*Eingabeblatt!I11)+(VLOOKUP(Eingabeblatt!$G11,'Table males'!$A$3:$E$138,4)*Eingabeblatt!H11)+(VLOOKUP(Eingabeblatt!$G11,'Table males'!$A$3:$E$138,5)*(Eingabeblatt!J11+Eingabeblatt!K11)/2)),VLOOKUP(Eingabeblatt!$G11,'Table females'!$A$3:$E$138,2)+(VLOOKUP(Eingabeblatt!$G11,'Table females'!$A$3:$E$138,3)*Eingabeblatt!I11)+(VLOOKUP(Eingabeblatt!$G11,'Table females'!$A$3:$E$138,4)*Eingabeblatt!H11)+(VLOOKUP(Eingabeblatt!$G11,'Table females'!$A$3:$E$138,5)*(Eingabeblatt!J11+Eingabeblatt!K11)/2)))","v":""},{"$f":"CONCATENATE(\" \",IF(OR(J11=\"\",K11=\"\",L11=\"\"),\"\",IF(B11=\"m\",'Table males'!D$141,'Table females'!D$141)))","v":" "},"","",null,"Erwachsenengrösse"]
[{"$nulls":6},"",{"$nulls":4},{"$f":"IF(OR(C12=\"\",G12=\"\",H12=\"\",I12=\"\",K12=\"\",B12=Dropdownliste!A$9,J12=\"\"),\"\",IF(B12=\"m\",(VLOOKUP(Eingabeblatt!$G12,'Table males'!$A$3:$E$138,2)+(VLOOKUP(Eingabeblatt!$G12,'Table males'!$A$3:$E$138,3)*Eingabeblatt!I12)+(VLOOKUP(Eingabeblatt!$G12,'Table males'!$A$3:$E$138,4)*Eingabeblatt!H12)+(VLOOKUP(Eingabeblatt!$G12,'Table males'!$A$3:$E$138,5)*(Eingabeblatt!J12+Eingabeblatt!K12)/2)),VLOOKUP(Eingabeblatt!$G12,'Table females'!$A$3:$E$138,2)+(VLOOKUP(Eingabeblatt!$G12,'Table females'!$A$3:$E$138,3)*Eingabeblatt!I12)+(VLOOKUP(Eingabeblatt!$G12,'Table females'!$A$3:$E$138,4)*Eingabeblatt!H12)+(VLOOKUP(Eingabeblatt!$G12,'Table females'!$A$3:$E$138,5)*(Eingabeblatt!J12+Eingabeblatt!K12)/2)))","v":""},{"$f":"CONCATENATE(\" \",IF(OR(J12=\"\",K12=\"\",L12=\"\"),\"\",IF(B12=\"m\",'Table males'!D$141,'Table females'!D$141)))","v":" "},"","",null,"Pourcentage","Estimation du dévelopment biologique"]
[{"$nulls":6},"",{"$nulls":4},{"$f":"IF(OR(C13=\"\",G13=\"\",H13=\"\",I13=\"\",K13=\"\",B13=Dropdownliste!A$9,J13=\"\"),\"\",IF(B13=\"m\",(VLOOKUP(Eingabeblatt!$G13,'Table males'!$A$3:$E$138,2)+(VLOOKUP(Eingabeblatt!$G13,'Table males'!$A$3:$E$138,3)*Eingabeblatt!I13)+(VLOOKUP(Eingabeblatt!$G13,'Table males'!$A$3:$E$138,4)*Eingabeblatt!H13)+(VLOOKUP(Eingabeblatt!$G13,'Table males'!$A$3:$E$138,5)*(Eingabeblatt!J13+Eingabeblatt!K13)/2)),VLOOKUP(Eingabeblatt!$G13,'Table females'!$A$3:$E$138,2)+(VLOOKUP(Eingabeblatt!$G13,'Table females'!$A$3:$E$138,3)*Eingabeblatt!I13)+(VLOOKUP(Eingabeblatt!$G13,'Table females'!$A$3:$E$138,4)*Eingabeblatt!H13)+(VLOOKUP(Eingabeblatt!$G13,'Table females'!$A$3:$E$138,5)*(Eingabeblatt!J13+Eingabeblatt!K13)/2)))","v":""},{"$f":"CONCATENATE(\" \",IF(OR(J13=\"\",K13=\"\",L13=\"\"),\"\",IF(B13=\"m\",'Table males'!D$141,'Table females'!D$141)))","v":" "},"","",null,"de la taille adulte"]
[{"$nulls":6},"",{"$nulls":4},{"$f":"IF(OR(C14=\"\",G14=\"\",H14=\"\",I14=\"\",K14=\"\",B14=Dropdownliste!A$9,J14=\"\"),\"\",IF(B14=\"m\",(VLOOKUP(Eingabeblatt!$G14,'Table males'!$A$3:$E$138,2)+(VLOOKUP(Eingabeblatt!$G14,'Table males'!$A$3:$E$138,3)*Eingabeblatt!I14)+(VLOOKUP(Eingabeblatt!$G14,'Table males'!$A$3:$E$138,4)*Eingabeblatt!H14)+(VLOOKUP(Eingabeblatt!$G14,'Table males'!$A$3:$E$138,5)*(Eingabeblatt!J14+Eingabeblatt!K14)/2)),VLOOKUP(Eingabeblatt!$G14,'Table females'!$A$3:$E$138,2)+(VLOOKUP(Eingabeblatt!$G14,'Table females'!$A$3:$E$138,3)*Eingabeblatt!I14)+(VLOOKUP(Eingabeblatt!$G14,'Table females'!$A$3:$E$138,4)*Eingabeblatt!H14)+(VLOOKUP(Eingabeblatt!$G14,'Table females'!$A$3:$E$138,5)*(Eingabeblatt!J14+Eingabeblatt!K14)/2)))","v":""},{"$f":"CONCATENATE(\" \",IF(OR(J14=\"\",K14=\"\",L14=\"\"),\"\",IF(B14=\"m\",'Table males'!D$141,'Table females'!D$141)))","v":" "},"","",null,"< 80%","vorpubertär / prépubère"]
[{"$nulls":6},"",{"$nulls":4},{"$f":"IF(OR(C15=\"\",G15=\"\",H15=\"\",I15=\"\",K15=\"\",B15=Dropdownliste!A$9,J15=\"\"),\"\",IF(B15=\"m\",(VLOOKUP(Eingabeblatt!$G15,'Table males'!$A$3:$E$138,2)+(VLOOKUP(Eingabeblatt!$G15,'Table males'!$A$3:$E$138,3)*Eingabeblatt!I15)+(VLOOKUP(Eingabeblatt!$G15,'Table males'!$A$3:$E$138,4)*Eingabeblatt!H15)+(VLOOKUP(Eingabeblatt!$G15,'Table males'!$A$3:$E$138,5)*(Eingabeblatt!J15+Eingabeblatt!K15)/2)),VLOOKUP(Eingabeblatt!$G15,'Table females'!$A$3:$E$138,2)+(VLOOKUP(Eingabeblatt!$G15,'Table females'!$A$3:$E$138,3)*Eingabeblatt!I15)+(VLOOKUP(Eingabeblatt!$G15,'Table females'!$A$3:$E$138,4)*Eingabeblatt!H15)+(VLOOKUP(Eingabeblatt!$G15,'Table females'!$A$3:$E$138,5)*(Eingabeblatt!J15+Eingabeblatt!K15)/2)))","v":""},{"$f":"CONCATENATE(\" \",IF(OR(J15=\"\",K15=\"\",L15=\"\"),\"\",IF(B15=\"m\",'Table males'!D$141,'Table females'!D$141)))","v":" "},"","",null,"80 - 90%","frühpubertär / début de la puberté"]
{"$rows_left_out":487}
{"sheet":"Table males","index":3,"n_rows":141,"n_cols":10,"rows_kept":141,"hidden":true,"merged":[[0,0,0,4],[139,0,139,1],[140,0,140,1]]}
["Table l. Coeffs for males"]
["Age","B0","height","weight","Midparent",null,"B0","Stature","Weight","Midparent"]
[{"v":4,"d":"4.0"},-26.0521,1.23812,-0.48849,0.50286,null,{"$f":"(B3-B8)/5","v":0.23481999999999986},{"$f":"(C3-C8)/5","v":0.015696000000000022},{"$f":"(D3-D8)/5","v":-0.014313999999999993},-0.005201999999999996]
[4.1,{"$f":"B3-G3","v":-26.28692},{"$f":"C3-H3","v":1.2224240000000002},-0.474176,0.508062,null,{"$f":"(B3-B8)/5","v":0.23481999999999986},{"$f":"(C3-C8)/5","v":0.015696000000000022},-0.014313999999999993,-0.005201999999999996]
[4.2,{"$f":"B4-G4","v":-26.521739999999998},1.2067280000000002,-0.459862,0.513264,null,{"$f":"(B3-B8)/5","v":0.23481999999999986},{"$f":"(C3-C8)/5","v":0.015696000000000022},-0.014313999999999993,-0.005201999999999996]
[4.3,-26.756559999999997,1.1910320000000003,-0.445548,0.5184660000000001,null,{"$f":"(B3-B8)/5","v":0.23481999999999986},{"$f":"(C3-C8)/5","v":0.015696000000000022},-0.014313999999999993,-0.005201999999999996]
[4.4,-26.991379999999996,1.1753360000000004,-0.431234,0.5236680000000001,null,{"$f":"(B3-B8)/5","v":0.23481999999999986},{"$f":"(C3-C8)/5","v":0.015696000000000022},-0.014313999999999993,-0.005201999999999996]
[4.5,-27.2262,1.15964,-0.41692,0.52887,null,{"$f":"(B8-B13)/5","v":0.15360000000000013},{"$f":"(C8-C13)/5","v":0.010633999999999987},{"$f":"(D8-D13)/5","v":-0.010836000000000002},-2.063999999999999E-3]
[4.6,{"$f":"B8-G8","v":-27.3798},{"$f":"C8-H8","v":1.149006},{"$f":"D8-I8","v":-0.406084},{"$f":"E8-J8","v":0.5309339999999999},null,{"$f":"(B8-B13)/5","v":0.15360000000000013},{"$f":"(C8-C13)/5","v":0.010633999999999987},{"$f":"(D8-D13)/5","v":-0.010836000000000002},{"$f":"(E8-E13)/5","v":-2.063999999999999E-3}]
[4.7,{"$f":"B9-G9","v":-27.5334},1.138372,-0.395248,0.5329979999999999,null,{"$f":"(B8-B13)/5","v":0.15360000000000013},{"$f":"(C8-C13)/5","v":0.010633999999999987},{"$f":"(D8-D13)/5","v":-0.010836000000000002},{"$f":"(E8-E13)/5","v":-2.063999999999999E-3}]
[4.8,-27.687,1.127738,-0.384412,0.5350619999999998,null,{"$f":"(B8-B13)/5","v":0.15360000000000013},{"$f":"(C8-C13)/5","v":0.010633999999999987},{"$f":"(D8-D13)/5","v":-0.010836000000000002},{"$f":"(E8-E13)/5","v":-2.063999999999999E-3}]
[4.9,-27.840600000000002,1.1171039999999999,-0.37357599999999996,0.5371259999999998,null,{"$f":"(B8-B13)/5","v":0.15360000000000013},{"$f":"(C8-C13)/5","v":0.010633999999999987},{"$f":"(D8-D13)/5","v":-0.010836000000000002},{"$f":"(E8-E13)/5","v":-2.063999999999999E-3}]
[{"v":5,"d":"5.0"},-27.9942,1.10647,-0.36274,0.53919,null,{"$f":"(B13-B18)/5","v":0.06824000000000012},{"$f":"(C13-C18)/5","v":0.006334000000000018},{"$f":"(D13-D18)/5","v":-0.00786},4.5599999999998973E-4]
[5.1,{"$f":"B13-G13","v":-28.06244},{"$f":"C13-H13","v":1.100136},{"$f":"D13-I13","v":-0.35488000000000003},{"$f":"E13-J13","v":0.5387339999999999},null,{"$f":"(B13-B18)/5","v":0.06824000000000012},{"$f":"(C13-C18)/5","v":0.006334000000000018},{"$f":"(D13-D18)/5","v":-0.00786},{"$f":"(E13-E18)/5","v":4.5599999999998973E-4}]
[5.2,{"$f":"B14-G14","v":-28.130679999999998},1.093802,-0.34702000000000005,0.5382779999999999,null,{"$f":"(B13-B18)/5","v":0.06824000000000012},{"$f":"(C13-C18)/5","v":0.006334000000000018},{"$f":"(D13-D18)/5","v":-0.00786},{"$f":"(E13-E18)/5","v":4.5599999999998973E-4}]
{"$rows_left_out":127}
{"sheet":"Table females","index":4,"n_rows":141,"n_cols":10,"rows_kept":141,"hidden":true,"merged":[[0,0,0,4],[139,0,139,1],[140,0,140,1]]}
["Table lI. Coeffs for females"]
["Age","B0","Stature","Weight","Midparent",null,"B0","Stature","Weight","Midparent"]
[{"v":4,"d":"4.0"},-20.6566,1.24768,-1.0883,0.44774,null,{"$f":"(B3-B8)/5","v":-0.8412199999999999},{"$f":"(C3-C8)/5","v":0.005181999999999976},-0.010258000000000012,6.786000000000003E-3]
[4.1,{"$f":"B3-G3","v":-19.81538},{"$f":"C3-H3","v":1.2424979999999999},-1.078042,0.440954,null,{"$f":"(B3-B8)/5","v":-0.8412199999999999},{"$f":"(C3-C8)/5","v":0.005181999999999976},-0.010258000000000012,6.786000000000003E-3]
[4.2,{"$f":"B4-G4","v":-18.97416},{"$f":"C4-H4","v":1.2373159999999999},{"$f":"D4-I4","v":-1.0677839999999998},{"$f":"E4-J4","v":0.434168},null,{"$f":"(B3-B8)/5","v":-0.8412199999999999},{"$f":"(C3-C8)/5","v":0.005181999999999976},-0.010258000000000012,6.786000000000003E-3]
[4.3,-18.13294,1.2321339999999998,-1.0575259999999997,0.427382,null,{"$f":"(B3-B8)/5","v":-0.8412199999999999},{"$f":"(C3-C8)/5","v":0.005181999999999976},-0.010258000000000012,6.786000000000003E-3]
[4.4,-17.29172,1.2269519999999998,-1.0472679999999996,0.42059599999999997,null,{"$f":"(B3-B8)/5","v":-0.8412199999999999},{"$f":"(C3-C8)/5","v":0.005181999999999976},-0.010258000000000012,6.786000000000003E-3]
[4.5,-16.4505,1.22177,-1.03701,0.41381,null,{"$f":"(B8-B13)/5","v":-0.6811000000000004},{"$f":"(C8-C13)/5","v":4.4900000000000165E-3},{"$f":"(D8-D13)/5","v":-0.011080000000000001},{"$f":"(E8-E13)/5","v":0.005828}]
[4.6,{"$f":"B8-G8","v":-15.769400000000001},{"$f":"C8-H8","v":1.21728},{"$f":"D8-I8","v":-1.02593},{"$f":"E8-J8","v":0.407982},null,{"$f":"(B8-B13)/5","v":-0.6811000000000004},{"$f":"(C8-C13)/5","v":4.4900000000000165E-3},{"$f":"(D8-D13)/5","v":-0.011080000000000001},{"$f":"(E8-E13)/5","v":0.005828}]
[4.7,{"$f":"B9-G9","v":-15.0883},1.2127899999999998,-1.01485,0.402154,null,{"$f":"(B8-B13)/5","v":-0.6811000000000004},{"$f":"(C8-C13)/5","v":4.4900000000000165E-3},{"$f":"(D8-D13)/5","v":-0.011080000000000001},{"$f":"(E8-E13)/5","v":0.005828}]
[4.8,-14.4072,1.2082999999999997,-1.00377,0.396326,null,{"$f":"(B8-B13)/5","v":-0.6811000000000004},{"$f":"(C8-C13)/5","v":4.4900000000000165E-3},{"$f":"(D8-D13)/5","v":-0.011080000000000001},{"$f":"(E8-E13)/5","v":0.005828}]
[4.9,-13.726099999999999,1.2038099999999996,-0.9926900000000001,0.390498,null,{"$f":"(B8-B13)/5","v":-0.6811000000000004},{"$f":"(C8-C13)/5","v":4.4900000000000165E-3},{"$f":"(D8-D13)/5","v":-0.011080000000000001},{"$f":"(E8-E13)/5","v":0.005828}]
[{"v":5,"d":"5.0"},-13.045,1.19932,-0.98161,0.38467,null,{"$f":"(B13-B18)/5","v":-0.5069399999999998},{"$f":"(C13-C18)/5","v":4.103999999999974E-3},{"$f":"(D13-D18)/5","v":-0.011708000000000007},{"$f":"(E13-E18)/5","v":0.004856000000000004}]
[5.1,{"$f":"B13-G13","v":-12.53806},{"$f":"C13-H13","v":1.195216},{"$f":"D13-I13","v":-0.9699019999999999},{"$f":"E13-J13","v":0.379814},null,{"$f":"(B13-B18)/5","v":-0.5069399999999998},{"$f":"(C13-C18)/5","v":4.103999999999974E-3},{"$f":"(D13-D18)/5","v":-0.011708000000000007},{"$f":"(E13-E18)/5","v":0.004856000000000004}]
[5.2,{"$f":"B14-G14","v":-12.03112},1.1911120000000002,-0.9581939999999999,0.37495799999999996,null,{"$f":"(B13-B18)/5","v":-0.5069399999999998},{"$f":"(C13-C18)/5","v":4.103999999999974E-3},{"$f":"(D13-D18)/5","v":-0.011708000000000007},{"$f":"(E13-E18)/5","v":0.004856000000000004}]
{"$rows_left_out":127}
{"sheet":"Dropdownliste","index":5,"n_rows":9,"n_cols":1,"rows_kept":9,"hidden":true}
[]
[]
[" "]
[]
[]
[]
["m"]
["f"]
[" "]