{"text_format":"1","workbook":"xlsx","n_sheets":7,"sheets":["Anleitung","Instructions","Entrée des données_Eingabemaske","Interpretation","Berechnungen","Perzentile","Perzentile_Graphik"],"not_rendered":{"charts":1,"images":6,"macros":1,"external_links":0,"defined_names":12,"comments":1,"pivot_tables":0},"unopened":[],"bounds":{"document_bytes":16777216,"sheet_cells":100000,"rows_first":2000,"rows_last":500,"rows_between":2000,"halvings":0,"cell_chars":16384,"cell_head_chars":4096},"cells_cut":0,"cells_raw":0,"read":"whole","date_system":"1900"}

{"sheet":"Anleitung","index":0,"n_rows":49,"n_cols":3,"rows_kept":49,"cut":false,"hidden":false,"merged":[[38,2,38,14]]}
[]
[null,"Monitoring des Wachstums"]
[null,"Das exakte und regelmässige Monitoring des Wachstums spielt im Nachwuchsleistungssport eine sehr wichtige Rolle"]
[null,null,"- das Monitoring des Wachstums liefert wichtige Hinweise zur Wachstumsphase des Athleten und sollte bei der Trainingssteuerung berücksichtigt werden"]
[null,null,"- mögliche Wachstumsstörungen können früh erkannt werden"]
[null,null,"Der Wachstumsverlauf sollte bei der Trainingsplanung beachtet werden. Je nach Wachstumsphase (Pubertät: bei Mädchen zwischen 8 und 15 Jahren, "]
[null,null,"bei Jungen zwischen 10 und 17 Jahren) sollte das Training an das Wachstum angepast werden, um zu hohe Tainingsintensitäten zu vermeiden"]
[null,null," und Verletzungen vorzubeugen."]
[]
[null,null,"In der Rubrik \"Interprétation\",werden 3 Beispiele zu unterschiedlichen Wachstumsverläufen beschrieben."]
{"$rows_left_out":40}
{"sheet":"Instructions","index":1,"n_rows":52,"n_cols":3,"rows_kept":52,"cut":false,"hidden":false,"merged":[]}
[]
[null,"Monitoring de la croissance"]
[null,"Suivre le processus de la croissance de près et de manière régulière d'un jeune athlète joue un rôle essentiel dans:"]
[null,null,"-l'observation de changement de vitesse de croissance. Ceci permet d'identifier dans quelle phase de croissance se trouve l'athlète."]
[null,null,"-l'identification d'éventuels problèmes de croissance."]
[]
[null,null," Lors de la planification de l'entrainement, la phase de croissance de l'athlète doit être prise en compte. Suivant la phase de croissance de l'athlète"]
[null,null,"(puberté: chez les filles entre 8 et 15 ans, chez les garçons entre 10 et 17 ans), l'entrainement devrait être adapté au développement afin de prévenir"]
[null,null,"des charges trop élevées/inadaptées et de provoquer des blessures en lien avec la croissance"]
[]
{"$rows_left_out":43}
{"sheet":"Entrée des données_Eingabemaske","index":2,"n_rows":75,"n_cols":22,"rows_kept":75,"cut":false,"hidden":false,"merged":[[73,12,73,25],[74,12,74,25],[2,21,2,25],[70,12,70,24],[3,11,3,15],[71,12,71,25],[72,12,72,25],[16,2,16,8],[13,13,13,14],[13,11,13,12],[9,11,9,12],[7,13,7,15],[11,13,11,14],[9,13,9,15],[7,11,7,12],[11,11,11,12]]}
[]
[]
[null,null,null,"männlich / masculin","weiblich / féminin",null,null,null,null,null,null,null,null,null,null,null,null,null,null,null,null,"Eidgenössisches Departement für Verteidigung,\nBevölkerungsschutz und Sport VBS\nBundesamt für Sport BASPO\nEidgenössische Hochschule für Sport Magglingen EHSM"]
[null,null,null,null,null,null,null,null,null,null,null,"Monitoring des Wachstums\nMonitoring de la croissance"]
[null,null,null,null,null,null,null,null,null,null,null,"Persönliche Angaben / Données personnelles"]
[]
[]
[null,null,null,null,null,null,null,null,null,null,null,"Name / Nom:",null,null,null,null,"* Fakultativ / facultatif"]
[]
[null,null,null,null,null,null,null,null,null,null,null,"Vorname / Prénom",null,null,null,null,"* Fakultativ / facultatif"]
{"$rows_left_out":66}
{"sheet":"Interpretation","index":3,"n_rows":0,"n_cols":0,"rows_kept":0,"cut":false,"hidden":false,"merged":[]}

{"sheet":"Berechnungen","index":4,"n_rows":120,"n_cols":6,"rows_kept":120,"cut":false,"hidden":true,"merged":[]}
["Datum der Messung","Geburtsdatum","Alter am Tag der Messung\nin Jahr","Alter am Tag der Messung\nin Monaten","Aufgerundet","Grösse"]
[{"$f":"'Entrée des données_Eingabemaske'!$E20","v":"00:00:00"},{"$f":"'Entrée des données_Eingabemaske'!$N$14","v":"00:00:00"},{"$f":"(A2-B2)/365","v":0},{"$f":"$C2*12","v":0},{"$f":"ROUND($D2,0)","v":0},{"$f":"'Entrée des données_Eingabemaske'!$F20","v":0}]
[{"$f":"'Entrée des données_Eingabemaske'!$E21","v":"00:00:00"},{"$f":"'Entrée des données_Eingabemaske'!$N$14","v":"00:00:00"},{"$f":"(A3-B3)/365","v":0},{"$f":"$C3*12","v":0},{"$f":"ROUND($D3,0)","v":0},{"$f":"'Entrée des données_Eingabemaske'!$F21","v":0}]
[{"$f":"'Entrée des données_Eingabemaske'!$E22","v":"00:00:00"},{"$f":"'Entrée des données_Eingabemaske'!$N$14","v":"00:00:00"},0,0,0,{"$f":"'Entrée des données_Eingabemaske'!$F22","v":0}]
[{"$f":"'Entrée des données_Eingabemaske'!$E23","v":"00:00:00"},{"$f":"'Entrée des données_Eingabemaske'!$N$14","v":"00:00:00"},0,0,0,{"$f":"'Entrée des données_Eingabemaske'!$F23","v":0}]
[{"$f":"'Entrée des données_Eingabemaske'!$E24","v":"00:00:00"},{"$f":"'Entrée des données_Eingabemaske'!$N$14","v":"00:00:00"},0,0,0,{"$f":"'Entrée des données_Eingabemaske'!$F24","v":0}]
[{"$f":"'Entrée des données_Eingabemaske'!$E25","v":"00:00:00"},{"$f":"'Entrée des données_Eingabemaske'!$N$14","v":"00:00:00"},0,0,0,{"$f":"'Entrée des données_Eingabemaske'!$F25","v":0}]
[{"$f":"'Entrée des données_Eingabemaske'!$E26","v":"00:00:00"},{"$f":"'Entrée des données_Eingabemaske'!$N$14","v":"00:00:00"},0,0,0,{"$f":"'Entrée des données_Eingabemaske'!$F26","v":0}]
[{"$f":"'Entrée des données_Eingabemaske'!$E27","v":"00:00:00"},{"$f":"'Entrée des données_Eingabemaske'!$N$14","v":"00:00:00"},0,0,0,{"$f":"'Entrée des données_Eingabemaske'!$F27","v":0}]
[{"$f":"'Entrée des données_Eingabemaske'!$E28","v":"00:00:00"},{"$f":"'Entrée des données_Eingabemaske'!$N$14","v":"00:00:00"},0,0,0,{"$f":"'Entrée des données_Eingabemaske'!$F28","v":0}]
{"$rows_left_out":111}
{"sheet":"Perzentile","index":5,"n_rows":267,"n_cols":25,"rows_kept":267,"cut":false,"hidden":true,"merged":[[0,2,0,11],[0,12,0,21]]}
[null,null,"Knaben",null,null,null,null,null,null,null,null,null,"Mädchen"]
["Age","Month","L","M","SD","P3","P10","P25","P50","P75","P90","P97","L","M","SD","P3","P10","P25","P50","P75","P90","P97","Taille actuelle","Z-score","Percentile"]
[{"$f":"B3/12","v":8.3333333333333329E-2},1,1,54.724400000000003,3.5569999999999997E-2,51.063347017467024,52.2297997626466,53.411474062278124,54.724400000000003,56.037325937721882,57.219000237353399,58.385452982532982,1,53.687199999999997,3.6400000000000002E-2,50.011726649376818,51.182773886366689,52.369102633351133,53.687199999999997,55.005297366648861,56.191626113633305,57.362673350623183,{"$f":"VLOOKUP(Perzentile!B3,Berechnungen!$E$2:$F$40,2,FALSE)","v":{"$error":"#N/A"}},{"$f":"IF('Entrée des données_Eingabemaske'!$N$12=\"männlich / masculin\",((W3/D3)^C3-1)/C3/E3,((W3/N3)^M3-1)/M3/O3)","v":{"$error":"#N/A"}},{"$f":"_xlfn.NORM.S.DIST(X3,TRUE)","v":{"$error":"#N/A"}}]
[0.16666666666666666,2,1,58.424900000000001,3.424E-2,54.662431488951768,55.861196364604425,57.075604449898648,58.424900000000001,59.774195550101361,60.988603635395584,62.187368511048234,1,57.067300000000003,3.5680000000000003E-2,53.23770090950363,54.45785434441953,55.693930097685708,57.067300000000003,58.440669902314298,59.676745655580476,60.896899090496369,{"$f":"VLOOKUP(Perzentile!B4,Berechnungen!$E$2:$F$40,2,FALSE)","v":{"$error":"#N/A"}},{"$f":"IF('Entrée des données_Eingabemaske'!$N$12=\"männlich / masculin\",((W4/D4)^C4-1)/C4/E4,((W4/N4)^M4-1)/M4/O4)","v":{"$error":"#N/A"}},{"$error":"#N/A"}]
[0.25,3,1,61.429200000000002,3.3279999999999997E-2,57.584173677363246,58.809242402324529,60.050297587415848,61.429200000000002,62.808102412584155,64.049157597675475,65.27422632263675,1,59.802900000000001,3.5200000000000002E-2,55.843712695174425,57.105154395807425,58.383057203513559,59.802900000000001,61.222742796486443,62.500645604192584,63.762087304825585,{"$f":"VLOOKUP(Perzentile!B5,Berechnungen!$E$2:$F$40,2,FALSE)","v":{"$error":"#N/A"}},{"$f":"IF('Entrée des données_Eingabemaske'!$N$12=\"männlich / masculin\",((W5/D5)^C5-1)/C5/E5,((W5/N5)^M5-1)/M5/O5)","v":{"$error":"#N/A"}},{"$error":"#N/A"}]
[0.33333333333333331,4,1,63.886000000000003,3.2570000000000002E-2,59.972506688732082,61.219389767985433,62.482543972463958,63.886000000000003,65.289456027536048,66.552610232014572,67.799493311267938,1,62.0899,3.4860000000000002E-2,58.019008913410843,59.316040697964162,60.629998020235206,62.0899,63.549801979764801,64.863759302035845,66.160791086589157,{"$f":"VLOOKUP(Perzentile!B6,Berechnungen!$E$2:$F$40,2,FALSE)","v":{"$error":"#N/A"}},{"$f":"IF('Entrée des données_Eingabemaske'!$N$12=\"männlich / masculin\",((W6/D6)^C6-1)/C6/E6,((W6/N6)^M6-1)/M6/O6)","v":{"$error":"#N/A"}},{"$error":"#N/A"}]
[0.41666666666666669,5,1,65.902600000000007,3.2039999999999999E-2,61.931267989548829,63.196579130281158,64.478401872110837,65.902600000000007,67.326798127889163,68.608620869718848,69.873932010451185,1,64.030100000000004,3.4630000000000001E-2,59.859699040714453,61.188435792317684,62.534511813685938,64.030100000000004,65.525688186314056,66.871764207682332,68.200500959285563,{"$f":"VLOOKUP(Perzentile!B7,Berechnungen!$E$2:$F$40,2,FALSE)","v":{"$error":"#N/A"}},{"$f":"IF('Entrée des données_Eingabemaske'!$N$12=\"männlich / masculin\",((W7/D7)^C7-1)/C7/E7,((W7/N7)^M7-1)/M7/O7)","v":{"$error":"#N/A"}},{"$error":"#N/A"}]
[0.5,6,1,67.623599999999996,3.1649999999999998E-2,63.598162003638393,64.880711921328327,66.179998396491456,67.623599999999996,69.067201603508522,70.366488078671665,71.649037996361585,1,65.731099999999998,3.4479999999999997E-2,61.468453703236833,62.826580859088274,64.202430813004966,65.731099999999998,67.25976918699503,68.635619140911729,69.993746296763149,{"$f":"VLOOKUP(Perzentile!B8,Berechnungen!$E$2:$F$40,2,FALSE)","v":{"$error":"#N/A"}},{"$f":"IF('Entrée des données_Eingabemaske'!$N$12=\"männlich / masculin\",((W8/D8)^C8-1)/C8/E8,((W8/N8)^M8-1)/M8/O8)","v":{"$error":"#N/A"}},{"$error":"#N/A"}]
[0.58333333333333337,7,1,69.164500000000004,3.1390000000000001E-2,65.081158546850432,66.382157158522119,67.700133072781753,69.164500000000004,70.628866927218255,71.946842841477903,73.247841453149576,1,67.287300000000002,3.4410000000000003E-2,62.932593247770903,64.32005190237777,65.725616114666423,67.287300000000002,68.848983885333581,70.254548097622234,71.642006752229094,{"$f":"VLOOKUP(Perzentile!B9,Berechnungen!$E$2:$F$40,2,FALSE)","v":{"$error":"#N/A"}},{"$f":"IF('Entrée des données_Eingabemaske'!$N$12=\"männlich / masculin\",((W9/D9)^C9-1)/C9/E9,((W9/N9)^M9-1)/M9/O9)","v":{"$error":"#N/A"}},{"$error":"#N/A"}]
[0.66666666666666663,8,1,70.599400000000003,3.124E-2,66.451262195899048,67.772905655325047,69.111795821029418,70.599400000000003,72.087004178970602,73.425894344674958,74.747537804100958,1,68.749799999999993,3.44E-2,64.301736056582314,65.718939364561777,67.154636381275736,68.749799999999993,70.344963618724236,71.780660635438196,73.197863943417673,{"$f":"VLOOKUP(Perzentile!B10,Berechnungen!$E$2:$F$40,2,FALSE)","v":{"$error":"#N/A"}},{"$f":"IF('Entrée des données_Eingabemaske'!$N$12=\"männlich / masculin\",((W10/D10)^C10-1)/C10/E10,((W10/N10)^M10-1)/M10/O10)","v":{"$error":"#N/A"}},{"$error":"#N/A"}]
{"$rows_left_out":258}
{"sheet":"Perzentile_Graphik","index":6,"n_rows":266,"n_cols":20,"rows_kept":266,"cut":false,"hidden":true,"merged":[]}
["Age arrondi","Age","Month","L","M","SD","P3","P10","P25","P50","P75","P90","P97","Grösse / Taille","Z-score","Percentile","Si(Eingabemaske=\"\")"]
[{"$f":"ROUND(B2,1)","v":0.1},{"$f":"C2/12","v":8.3333333333333329E-2},1,{"$f":"IF('Entrée des données_Eingabemaske'!$N$12=\"männlich / masculin\",Perzentile!C3,Perzentile!M3)","v":1},{"$f":"IF('Entrée des données_Eingabemaske'!$N$12=\"männlich / masculin\",Perzentile!D3,Perzentile!N3)","v":53.687199999999997},{"$f":"IF('Entrée des données_Eingabemaske'!$N$12=\"männlich / masculin\",Perzentile!E3,Perzentile!O3)","v":3.6400000000000002E-2},{"$f":"IF('Entrée des données_Eingabemaske'!$N$12=\"männlich / masculin\",Perzentile!F3,Perzentile!P3)","v":50.011726649376818},{"$f":"IF('Entrée des données_Eingabemaske'!$N$12=\"männlich / masculin\",Perzentile!G3,Perzentile!Q3)","v":51.182773886366689},{"$f":"IF('Entrée des données_Eingabemaske'!$N$12=\"männlich / masculin\",Perzentile!H3,Perzentile!R3)","v":52.369102633351133},{"$f":"IF('Entrée des données_Eingabemaske'!$N$12=\"männlich / masculin\",Perzentile!I3,Perzentile!S3)","v":53.687199999999997},{"$f":"IF('Entrée des données_Eingabemaske'!$N$12=\"männlich / masculin\",Perzentile!J3,Perzentile!T3)","v":55.005297366648861},{"$f":"IF('Entrée des données_Eingabemaske'!$N$12=\"männlich / masculin\",Perzentile!K3,Perzentile!U3)","v":56.191626113633305},{"$f":"IF('Entrée des données_Eingabemaske'!$N$12=\"männlich / masculin\",Perzentile!L3,Perzentile!V3)","v":57.362673350623183},{"$f":"Perzentile!W3","v":{"$error":"#N/A"}},{"$f":"Perzentile!X3","v":{"$error":"#N/A"}},{"$f":"Perzentile!Y3","v":{"$error":"#N/A"}},0]
[{"$f":"ROUND(B3,1)","v":0.2},0.16666666666666666,2,{"$f":"IF('Entrée des données_Eingabemaske'!$N$12=\"männlich / masculin\",Perzentile!C4,Perzentile!M4)","v":1},{"$f":"IF('Entrée des données_Eingabemaske'!$N$12=\"männlich / masculin\",Perzentile!D4,Perzentile!N4)","v":57.067300000000003},{"$f":"IF('Entrée des données_Eingabemaske'!$N$12=\"männlich / masculin\",Perzentile!E4,Perzentile!O4)","v":3.5680000000000003E-2},{"$f":"IF('Entrée des données_Eingabemaske'!$N$12=\"männlich / masculin\",Perzentile!F4,Perzentile!P4)","v":53.23770090950363},{"$f":"IF('Entrée des données_Eingabemaske'!$N$12=\"männlich / masculin\",Perzentile!G4,Perzentile!Q4)","v":54.45785434441953},{"$f":"IF('Entrée des données_Eingabemaske'!$N$12=\"männlich / masculin\",Perzentile!H4,Perzentile!R4)","v":55.693930097685708},{"$f":"IF('Entrée des données_Eingabemaske'!$N$12=\"männlich / masculin\",Perzentile!I4,Perzentile!S4)","v":57.067300000000003},{"$f":"IF('Entrée des données_Eingabemaske'!$N$12=\"männlich / masculin\",Perzentile!J4,Perzentile!T4)","v":58.440669902314298},{"$f":"IF('Entrée des données_Eingabemaske'!$N$12=\"männlich / masculin\",Perzentile!K4,Perzentile!U4)","v":59.676745655580476},{"$f":"IF('Entrée des données_Eingabemaske'!$N$12=\"männlich / masculin\",Perzentile!L4,Perzentile!V4)","v":60.896899090496369},{"$f":"Perzentile!W4","v":{"$error":"#N/A"}},{"$f":"Perzentile!X4","v":{"$error":"#N/A"}},{"$f":"Perzentile!Y4","v":{"$error":"#N/A"}},0]
[0.3,0.25,3,{"$f":"IF('Entrée des données_Eingabemaske'!$N$12=\"männlich / masculin\",Perzentile!C5,Perzentile!M5)","v":1},{"$f":"IF('Entrée des données_Eingabemaske'!$N$12=\"männlich / masculin\",Perzentile!D5,Perzentile!N5)","v":59.802900000000001},{"$f":"IF('Entrée des données_Eingabemaske'!$N$12=\"männlich / masculin\",Perzentile!E5,Perzentile!O5)","v":3.5200000000000002E-2},{"$f":"IF('Entrée des données_Eingabemaske'!$N$12=\"männlich / masculin\",Perzentile!F5,Perzentile!P5)","v":55.843712695174425},{"$f":"IF('Entrée des données_Eingabemaske'!$N$12=\"männlich / masculin\",Perzentile!G5,Perzentile!Q5)","v":57.105154395807425},{"$f":"IF('Entrée des données_Eingabemaske'!$N$12=\"männlich / masculin\",Perzentile!H5,Perzentile!R5)","v":58.383057203513559},{"$f":"IF('Entrée des données_Eingabemaske'!$N$12=\"männlich / masculin\",Perzentile!I5,Perzentile!S5)","v":59.802900000000001},{"$f":"IF('Entrée des données_Eingabemaske'!$N$12=\"männlich / masculin\",Perzentile!J5,Perzentile!T5)","v":61.222742796486443},{"$f":"IF('Entrée des données_Eingabemaske'!$N$12=\"männlich / masculin\",Perzentile!K5,Perzentile!U5)","v":62.500645604192584},{"$f":"IF('Entrée des données_Eingabemaske'!$N$12=\"männlich / masculin\",Perzentile!L5,Perzentile!V5)","v":63.762087304825585},{"$f":"Perzentile!W5","v":{"$error":"#N/A"}},{"$f":"Perzentile!X5","v":{"$error":"#N/A"}},{"$f":"Perzentile!Y5","v":{"$error":"#N/A"}},0,"1) définir le début"]
[0.3,0.33333333333333331,4,{"$f":"IF('Entrée des données_Eingabemaske'!$N$12=\"männlich / masculin\",Perzentile!C6,Perzentile!M6)","v":1},{"$f":"IF('Entrée des données_Eingabemaske'!$N$12=\"männlich / masculin\",Perzentile!D6,Perzentile!N6)","v":62.0899},{"$f":"IF('Entrée des données_Eingabemaske'!$N$12=\"männlich / masculin\",Perzentile!E6,Perzentile!O6)","v":3.4860000000000002E-2},{"$f":"IF('Entrée des données_Eingabemaske'!$N$12=\"männlich / masculin\",Perzentile!F6,Perzentile!P6)","v":58.019008913410843},{"$f":"IF('Entrée des données_Eingabemaske'!$N$12=\"männlich / masculin\",Perzentile!G6,Perzentile!Q6)","v":59.316040697964162},{"$f":"IF('Entrée des données_Eingabemaske'!$N$12=\"männlich / masculin\",Perzentile!H6,Perzentile!R6)","v":60.629998020235206},{"$f":"IF('Entrée des données_Eingabemaske'!$N$12=\"männlich / masculin\",Perzentile!I6,Perzentile!S6)","v":62.0899},{"$f":"IF('Entrée des données_Eingabemaske'!$N$12=\"männlich / masculin\",Perzentile!J6,Perzentile!T6)","v":63.549801979764801},{"$f":"IF('Entrée des données_Eingabemaske'!$N$12=\"männlich / masculin\",Perzentile!K6,Perzentile!U6)","v":64.863759302035845},{"$f":"IF('Entrée des données_Eingabemaske'!$N$12=\"männlich / masculin\",Perzentile!L6,Perzentile!V6)","v":66.160791086589157},{"$f":"Perzentile!W6","v":{"$error":"#N/A"}},{"$f":"Perzentile!X6","v":{"$error":"#N/A"}},{"$f":"Perzentile!Y6","v":{"$error":"#N/A"}},0,{"$f":"MATCH(ROUND(MIN('Entrée des données_Eingabemaske'!$G$20:$G$74),1),Perzentile_Graphik!$A$1:$A$266,0)","v":{"$error":"#N/A"}},null,"=définir.début"]
[0.4,0.41666666666666669,5,{"$f":"IF('Entrée des données_Eingabemaske'!$N$12=\"männlich / masculin\",Perzentile!C7,Perzentile!M7)","v":1},{"$f":"IF('Entrée des données_Eingabemaske'!$N$12=\"männlich / masculin\",Perzentile!D7,Perzentile!N7)","v":64.030100000000004},{"$f":"IF('Entrée des données_Eingabemaske'!$N$12=\"männlich / masculin\",Perzentile!E7,Perzentile!O7)","v":3.4630000000000001E-2},{"$f":"IF('Entrée des données_Eingabemaske'!$N$12=\"männlich / masculin\",Perzentile!F7,Perzentile!P7)","v":59.859699040714453},{"$f":"IF('Entrée des données_Eingabemaske'!$N$12=\"männlich / masculin\",Perzentile!G7,Perzentile!Q7)","v":61.188435792317684},{"$f":"IF('Entrée des données_Eingabemaske'!$N$12=\"männlich / masculin\",Perzentile!H7,Perzentile!R7)","v":62.534511813685938},{"$f":"IF('Entrée des données_Eingabemaske'!$N$12=\"männlich / masculin\",Perzentile!I7,Perzentile!S7)","v":64.030100000000004},{"$f":"IF('Entrée des données_Eingabemaske'!$N$12=\"männlich / masculin\",Perzentile!J7,Perzentile!T7)","v":65.525688186314056},{"$f":"IF('Entrée des données_Eingabemaske'!$N$12=\"männlich / masculin\",Perzentile!K7,Perzentile!U7)","v":66.871764207682332},{"$f":"IF('Entrée des données_Eingabemaske'!$N$12=\"männlich / masculin\",Perzentile!L7,Perzentile!V7)","v":68.200500959285563},{"$f":"Perzentile!W7","v":{"$error":"#N/A"}},{"$f":"Perzentile!X7","v":{"$error":"#N/A"}},{"$f":"Perzentile!Y7","v":{"$error":"#N/A"}},0]
[0.5,0.5,6,{"$f":"IF('Entrée des données_Eingabemaske'!$N$12=\"männlich / masculin\",Perzentile!C8,Perzentile!M8)","v":1},{"$f":"IF('Entrée des données_Eingabemaske'!$N$12=\"männlich / masculin\",Perzentile!D8,Perzentile!N8)","v":65.731099999999998},{"$f":"IF('Entrée des données_Eingabemaske'!$N$12=\"männlich / masculin\",Perzentile!E8,Perzentile!O8)","v":3.4479999999999997E-2},{"$f":"IF('Entrée des données_Eingabemaske'!$N$12=\"männlich / masculin\",Perzentile!F8,Perzentile!P8)","v":61.468453703236833},{"$f":"IF('Entrée des données_Eingabemaske'!$N$12=\"männlich / masculin\",Perzentile!G8,Perzentile!Q8)","v":62.826580859088274},{"$f":"IF('Entrée des données_Eingabemaske'!$N$12=\"männlich / masculin\",Perzentile!H8,Perzentile!R8)","v":64.202430813004966},{"$f":"IF('Entrée des données_Eingabemaske'!$N$12=\"männlich / masculin\",Perzentile!I8,Perzentile!S8)","v":65.731099999999998},{"$f":"IF('Entrée des données_Eingabemaske'!$N$12=\"männlich / masculin\",Perzentile!J8,Perzentile!T8)","v":67.25976918699503},{"$f":"IF('Entrée des données_Eingabemaske'!$N$12=\"männlich / masculin\",Perzentile!K8,Perzentile!U8)","v":68.635619140911729},{"$f":"IF('Entrée des données_Eingabemaske'!$N$12=\"männlich / masculin\",Perzentile!L8,Perzentile!V8)","v":69.993746296763149},{"$f":"Perzentile!W8","v":{"$error":"#N/A"}},{"$f":"Perzentile!X8","v":{"$error":"#N/A"}},{"$f":"Perzentile!Y8","v":{"$error":"#N/A"}},0,"2) définir la fin"]
[0.6,0.58333333333333337,7,{"$f":"IF('Entrée des données_Eingabemaske'!$N$12=\"männlich / masculin\",Perzentile!C9,Perzentile!M9)","v":1},{"$f":"IF('Entrée des données_Eingabemaske'!$N$12=\"männlich / masculin\",Perzentile!D9,Perzentile!N9)","v":67.287300000000002},{"$f":"IF('Entrée des données_Eingabemaske'!$N$12=\"männlich / masculin\",Perzentile!E9,Perzentile!O9)","v":3.4410000000000003E-2},{"$f":"IF('Entrée des données_Eingabemaske'!$N$12=\"männlich / masculin\",Perzentile!F9,Perzentile!P9)","v":62.932593247770903},{"$f":"IF('Entrée des données_Eingabemaske'!$N$12=\"männlich / masculin\",Perzentile!G9,Perzentile!Q9)","v":64.32005190237777},{"$f":"IF('Entrée des données_Eingabemaske'!$N$12=\"männlich / masculin\",Perzentile!H9,Perzentile!R9)","v":65.725616114666423},{"$f":"IF('Entrée des données_Eingabemaske'!$N$12=\"männlich / masculin\",Perzentile!I9,Perzentile!S9)","v":67.287300000000002},{"$f":"IF('Entrée des données_Eingabemaske'!$N$12=\"männlich / masculin\",Perzentile!J9,Perzentile!T9)","v":68.848983885333581},{"$f":"IF('Entrée des données_Eingabemaske'!$N$12=\"männlich / masculin\",Perzentile!K9,Perzentile!U9)","v":70.254548097622234},{"$f":"IF('Entrée des données_Eingabemaske'!$N$12=\"männlich / masculin\",Perzentile!L9,Perzentile!V9)","v":71.642006752229094},{"$f":"Perzentile!W9","v":{"$error":"#N/A"}},{"$f":"Perzentile!X9","v":{"$error":"#N/A"}},{"$f":"Perzentile!Y9","v":{"$error":"#N/A"}},0,{"$f":"242-définir.début","v":{"$error":"#N/A"}},null,"=définir.fin"]
[0.7,0.66666666666666663,8,{"$f":"IF('Entrée des données_Eingabemaske'!$N$12=\"männlich / masculin\",Perzentile!C10,Perzentile!M10)","v":1},{"$f":"IF('Entrée des données_Eingabemaske'!$N$12=\"männlich / masculin\",Perzentile!D10,Perzentile!N10)","v":68.749799999999993},{"$f":"IF('Entrée des données_Eingabemaske'!$N$12=\"männlich / masculin\",Perzentile!E10,Perzentile!O10)","v":3.44E-2},{"$f":"IF('Entrée des données_Eingabemaske'!$N$12=\"männlich / masculin\",Perzentile!F10,Perzentile!P10)","v":64.301736056582314},{"$f":"IF('Entrée des données_Eingabemaske'!$N$12=\"männlich / masculin\",Perzentile!G10,Perzentile!Q10)","v":65.718939364561777},{"$f":"IF('Entrée des données_Eingabemaske'!$N$12=\"männlich / masculin\",Perzentile!H10,Perzentile!R10)","v":67.154636381275736},{"$f":"IF('Entrée des données_Eingabemaske'!$N$12=\"männlich / masculin\",Perzentile!I10,Perzentile!S10)","v":68.749799999999993},{"$f":"IF('Entrée des données_Eingabemaske'!$N$12=\"männlich / masculin\",Perzentile!J10,Perzentile!T10)","v":70.344963618724236},{"$f":"IF('Entrée des données_Eingabemaske'!$N$12=\"männlich / masculin\",Perzentile!K10,Perzentile!U10)","v":71.780660635438196},{"$f":"IF('Entrée des données_Eingabemaske'!$N$12=\"männlich / masculin\",Perzentile!L10,Perzentile!V10)","v":73.197863943417673},{"$f":"Perzentile!W10","v":{"$error":"#N/A"}},{"$f":"Perzentile!X10","v":{"$error":"#N/A"}},{"$f":"Perzentile!Y10","v":{"$error":"#N/A"}},0]
[0.8,0.75,9,{"$f":"IF('Entrée des données_Eingabemaske'!$N$12=\"männlich / masculin\",Perzentile!C11,Perzentile!M11)","v":1},{"$f":"IF('Entrée des données_Eingabemaske'!$N$12=\"männlich / masculin\",Perzentile!D11,Perzentile!N11)","v":70.143500000000003},{"$f":"IF('Entrée des données_Eingabemaske'!$N$12=\"männlich / masculin\",Perzentile!E11,Perzentile!O11)","v":3.4439999999999998E-2},{"$f":"IF('Entrée des données_Eingabemaske'!$N$12=\"männlich / masculin\",Perzentile!F11,Perzentile!P11)","v":65.59998762414638},{"$f":"IF('Entrée des données_Eingabemaske'!$N$12=\"männlich / masculin\",Perzentile!G11,Perzentile!Q11)","v":67.047601878530941},{"$f":"IF('Entrée des données_Eingabemaske'!$N$12=\"männlich / masculin\",Perzentile!H11,Perzentile!R11)","v":68.514106687453264},{"$f":"IF('Entrée des données_Eingabemaske'!$N$12=\"männlich / masculin\",Perzentile!I11,Perzentile!S11)","v":70.143500000000003},{"$f":"IF('Entrée des données_Eingabemaske'!$N$12=\"männlich / masculin\",Perzentile!J11,Perzentile!T11)","v":71.772893312546742},{"$f":"IF('Entrée des données_Eingabemaske'!$N$12=\"männlich / masculin\",Perzentile!K11,Perzentile!U11)","v":73.239398121469065},{"$f":"IF('Entrée des données_Eingabemaske'!$N$12=\"männlich / masculin\",Perzentile!L11,Perzentile!V11)","v":74.687012375853627},{"$f":"Perzentile!W11","v":{"$error":"#N/A"}},{"$f":"Perzentile!X11","v":{"$error":"#N/A"}},{"$f":"Perzentile!Y11","v":{"$error":"#N/A"}},0,"3) définir la valeur de l'axe des x"]
{"$rows_left_out":256}